[lkml]   [2022]   [Jan]   [24]   [last100]   RSS Feed
Views: [wrap][no wrap]   [headers]  [forward] 
Messages in this thread
SubjectRe: [PATCH 5.10 000/563] 5.10.94-rc1 review

> This is the start of the stable review cycle for the 5.10.94 release.
> There are 563 patches in this series, all will be posted as a response
> to this one. If anyone has any issues with these being applied, please
> let me know.

Our tests are unhappy, and it is more than gmp.h problem:


arch/arm64/mm/extable.c: In function 'fixup_exception':
1095arch/arm64/mm/extable.c:17:6: error: implicit declaration of function 'in_bpf_jit' [-Werror=implicit-function-declaration]
1096 if (in_bpf_jit(regs))
1097 ^~~~~~~~~~
1098cc1: some warnings being treated as errors
1099scripts/ recipe for target 'arch/arm64/mm/extable.o' failed
1100make[2]: *** [arch/arm64/mm/extable.o] Error 1
1101make[2]: *** Waiting for unfinished jobs....
1102 CC kernel/sched/loadavg.o
1103 CC arch/arm64/kernel/entry-common.o


arch/arm64/mm/extable.c: In function 'fixup_exception':
1129arch/arm64/mm/extable.c:17:6: error: implicit declaration of function 'in_bpf_jit' [-Werror=implicit-function-declaration]
1130 if (in_bpf_jit(regs))
1131 ^~~~~~~~~~
1132 CC arch/arm64/crypto/ghash-ce-glue.o
1133cc1: some warnings being treated as errors
1134scripts/ recipe for target 'arch/arm64/mm/extable.o' failed
1135make[2]: *** [arch/arm64/mm/extable.o] Error 1
1136make[2]: *** Waiting for unfinished jobs....
1137 CC arch/arm64/kvm/hyp/vhe/sysreg-sr.o

Best regards,
DENX Software Engineering GmbH, Managing Director: Wolfgang Denk
HRB 165235 Munich, Office: Kirchenstr.5, D-82194 Groebenzell, Germany
[unhandled content-type:application/pgp-signature]
 \ /
  Last update: 2022-01-24 22:09    [W:1.585 / U:0.064 seconds]
©2003-2020 Jasper Spaans|hosted at Digital Ocean and TransIP|Read the blog|Advertise on this site