lkml.org 
[lkml]   [2019]   [Dec]   [20]   [last100]   RSS Feed
Views: [wrap][no wrap]   [headers]  [forward] 
 
Messages in this thread
/
From
Date
SubjectRe: linux-next: Tree for Dec 20
On Fri, 20 Dec 2019 at 06:06, Stephen Rothwell <sfr@canb.auug.org.au> wrote:
>
> Hi all,

Hi all,

>
> News: There will be no linux-next releases until January 6 (unless I
> get very bored :-)).
>
> Changes since 20191219:

on arm64 I see this:

../drivers/scsi/ufs/ufs-mediatek.c: In function ‘ufs_mtk_setup_ref_clk’:
../drivers/scsi/ufs/ufs-mediatek.c:93:23: error: storage size of
‘res’ isn’t known
struct arm_smccc_res res;
^~~
../drivers/scsi/ufs/ufs-mediatek.c:21:2: error: implicit declaration
of function ‘arm_smccc_smc’
[-Werror=implicit-function-declaration]
arm_smccc_smc(MTK_SIP_UFS_CONTROL, \
^~~~~~~~~~~~~
../drivers/scsi/ufs/ufs-mediatek.c:101:3: note: in expansion of macro
‘ufs_mtk_ref_clk_notify’
ufs_mtk_ref_clk_notify(on, res);
^~~~~~~~~~~~~~~~~~~~~~
../drivers/scsi/ufs/ufs-mediatek.c:21:16: error:
‘MTK_SIP_UFS_CONTROL’ undeclared (first use in this function); did
you mean ‘TX_HIBERN8_CONTROL’?
arm_smccc_smc(MTK_SIP_UFS_CONTROL, \
^~~~~~~~~~~~~~~~~~~
../drivers/scsi/ufs/ufs-mediatek.c:101:3: note: in expansion of macro
‘ufs_mtk_ref_clk_notify’
ufs_mtk_ref_clk_notify(on, res);
^~~~~~~~~~~~~~~~~~~~~~
../drivers/scsi/ufs/ufs-mediatek.c:21:16: note: each undeclared
identifier is reported only once for each function it appears in
arm_smccc_smc(MTK_SIP_UFS_CONTROL, \
^~~~~~~~~~~~~~~~~~~
../drivers/scsi/ufs/ufs-mediatek.c:101:3: note: in expansion of macro
‘ufs_mtk_ref_clk_notify’
ufs_mtk_ref_clk_notify(on, res);
^~~~~~~~~~~~~~~~~~~~~~
../drivers/scsi/ufs/ufs-mediatek.c:93:23: warning: unused variable
‘res’ [-Wunused-variable]
struct arm_smccc_res res;
^~~
cc1: some warnings being treated as errors
make[4]: *** [../scripts/Makefile.build:266:
drivers/scsi/ufs/ufs-mediatek.o] Error 1
make[4]: Target '__build' not remade because of errors.
make[3]: *** [../scripts/Makefile.build:503: drivers/scsi/ufs] Error 2
make[3]: Target '__build' not remade because of errors.
make[2]: *** [../scripts/Makefile.build:503: drivers/scsi] Error 2
../drivers/staging/wilc1000/hif.c: In function ‘wilc_parse_join_bss_param’:
../drivers/staging/wilc1000/hif.c:574:45: warning: array subscript 2
is above array bounds of ‘u32[2]’ {aka ‘unsigned int[2]’}
[-Warray-bounds]
param->akm_suites[i] = crypto->akm_suites[i] & 0xFF;
~~~~~~~~~~~~~~~~~~^~~
make[2]: Target '__build' not remade because of errors.
make[1]: *** [/srv/jenkins/kernel/next/Makefile:1694: drivers] Error 2
make[1]: Target 'Image' not remade because of errors.
make[1]: Target 'modules' not remade because of errors.
make: *** [Makefile:179: sub-make] Error 2
make: Target 'Image' not remade because of errors.
make: Target 'modules' not remade because of errors.

Cheers,
Anders

\
 
 \ /
  Last update: 2019-12-20 12:56    [W:0.049 / U:0.092 seconds]
©2003-2020 Jasper Spaans|hosted at Digital Ocean and TransIP|Read the blog|Advertise on this site