lkml.org 
[lkml]   [2018]   [Apr]   [25]   [last100]   RSS Feed
Views: [wrap][no wrap]   [headers]  [forward] 
 
Messages in this thread
/
Date
From
SubjectRe: [PATCH v2] bpf, x86_32: add eBPF JIT compiler for ia32
On Wed, Apr 25, 2018 at 02:11:16AM +0200, Daniel Borkmann wrote:
> On 04/19/2018 05:54 PM, Wang YanQing wrote:
> > Testing results on i5-5200U:
> >
> > 1) test_bpf: Summary: 349 PASSED, 0 FAILED, [319/341 JIT'ed]
> > 2) test_progs: Summary: 81 PASSED, 2 FAILED.
> > test_progs report "libbpf: incorrect bpf_call opcode" for
> > test_l4lb_noinline and test_xdp_noinline, because there is
> > no llvm-6.0 on my machine, and current implementation doesn't
> > support BPF_PSEUDO_CALL, so I think we can ignore the two failed
> > testcases.
> > 3) test_lpm: OK
> > 4) test_lru_map: OK
> > 5) test_verifier: Summary: 823 PASSED, 5 FAILED
> > test_verifier report "invalid bpf_context access off=68 size=1/2/4/8"
> > for all the 5 FAILED testcases with/without jit, we need to fix the
> > failed testcases themself instead of this jit.
>
> Can you elaborate further on these? Looks like this definitely needs
> fixing on 32 bit. Would be great to get a better understanding of the
> underlying bug(s) and properly fix them.
>
Hi Daniel Borkmann, here is the detailed log for failed testcases.

linux: Gentoo 32 bit
llvm:
~ # llc --version
LLVM (http://llvm.org/):
LLVM version 4.0.1
Optimized build.
Default target: i686-pc-linux-gnu
Host CPU: broadwell

Registered Targets:
amdgcn - AMD GCN GPUs
bpf - BPF (host endian)
bpfeb - BPF (big endian)
bpfel - BPF (little endian)
nvptx - NVIDIA PTX 32-bit
nvptx64 - NVIDIA PTX 64-bit
r600 - AMD GPUs HD2XXX-HD6XXX
x86 - 32-bit X86: Pentium-Pro and above
x86-64 - 64-bit X86: EM64T and AMD64

~ # clang --version
clang version 4.0.1 (tags/RELEASE_401/final)
Target: i686-pc-linux-gnu
Thread model: posix
InstalledDir: /usr/lib/llvm/4/bin

kernel version:4.16.2
test program:test_verifier in kselftest
condition:bpf_jit_enable=0,bpf_jit_harden=0

log:
#172/p unpriv: spill/fill of different pointers ldx FAIL
Unexpected error message!
0: (bf) r6 = r10
1: (07) r6 += -8
2: (15) if r1 == 0x0 goto pc+3
R1=ctx(id=0,off=0,imm=0) R6=fp-8,call_-1 R10=fp0,call_-1
3: (bf) r2 = r10
4: (07) r2 += -76
5: (7b) *(u64 *)(r6 +0) = r2
6: (55) if r1 != 0x0 goto pc+1
R1=ctx(id=0,off=0,imm=0) R2=fp-76,call_-1 R6=fp-8,call_-1 R10=fp0,call_-1 fp-8=fp
7: (7b) *(u64 *)(r6 +0) = r1
8: (79) r1 = *(u64 *)(r6 +0)
9: (79) r1 = *(u64 *)(r1 +68)
invalid bpf_context access off=68 size=8

#378/p check bpf_perf_event_data->sample_period byte load permitted FAIL
Failed to load prog 'Permission denied'!
0: (b7) r0 = 0
1: (71) r0 = *(u8 *)(r1 +68)
invalid bpf_context access off=68 size=1
#379/p check bpf_perf_event_data->sample_period half load permitted FAIL
Failed to load prog 'Permission denied'!
0: (b7) r0 = 0
1: (69) r0 = *(u16 *)(r1 +68)
invalid bpf_context access off=68 size=2
#380/p check bpf_perf_event_data->sample_period word load permitted FAIL
Failed to load prog 'Permission denied'!
0: (b7) r0 = 0
1: (61) r0 = *(u32 *)(r1 +68)
invalid bpf_context access off=68 size=4
#381/p check bpf_perf_event_data->sample_period dword load permitted FAIL
Failed to load prog 'Permission denied'!
0: (b7) r0 = 0
1: (79) r0 = *(u64 *)(r1 +68)
invalid bpf_context access off=68 size=8


test program:test_progs
condition:bpf_jit_enable=0,bpf_jit_harden=0

bpf # ./test_progs
test_pkt_access:PASS:ipv4 53 nsec
test_pkt_access:PASS:ipv6 47 nsec
test_xdp:PASS:ipv4 1281 nsec
test_xdp:PASS:ipv6 749 nsec
test_l4lb:PASS:ipv4 427 nsec
test_l4lb:PASS:ipv6 562 nsec
libbpf: incorrect bpf_call opcode <= caused by ./test_l4lb_noinline.o in function test_l4lb_all
libbpf: incorrect bpf_call opcode <= caused by ././test_xdp_noinline.o in function test_xdp_noinline


Thanks.

\
 
 \ /
  Last update: 2018-04-26 03:44    [W:0.062 / U:6.624 seconds]
©2003-2020 Jasper Spaans|hosted at Digital Ocean and TransIP|Read the blog|Advertise on this site