[lkml]   [2016]   [Oct]   [31]   [last100]   RSS Feed
Views: [wrap][no wrap]   [headers]  [forward] 
Messages in this thread
Subjectmake pdfdocs fails with v4.9-rc3
Running make pdfdocs on a Ubuntu 16.04 system fails with

Makefile:58: recipe for target 'media.pdf' failed
make[2]: *** [media.pdf] Error 1
Documentation/Makefile.sphinx:79: recipe for target 'pdfdocs' failed
make[1]: *** [pdfdocs] Error 2
Makefile:1442: recipe for target 'pdfdocs' failed
make: *** [pdfdocs] Error 2

It's not clear from the voluminous (>5MB) output from make pdfdocs
exactly which stage is failing, and there are some pdf files produced
in output/latex.

This is with sphinx, rst2pdf, and texlive installed from the Ubuntu


 \ /
  Last update: 2016-10-31 19:52    [W:0.063 / U:0.096 seconds]
©2003-2020 Jasper Spaans|hosted at Digital Ocean and TransIP|Read the blog|Advertise on this site